可採粗鉱量
type: TerminologyConcept
description: 可採粗鉱量とは、埋蔵鉱量のうち実際に採掘しうる量に、採掘の際混入するズリの量を加えた量のこと。計算方法はＪＩＳＭ１００１及びＪＩＳＭ１００３による。
created: 2017-12-01
broader: Ta00282
top concept of: TerminologyConceptScheme
in scheme: TerminologyConceptScheme

RDF description of 可採粗鉱量
primary topic: 可採粗鉱量