RDF description of 加入した法人会員数
primary topic: 加入した法人会員数

加入した法人会員数
type: TerminologyConcept
in scheme: TerminologyConceptScheme
top concept of: TerminologyConceptScheme
broader: Ta00145
created: 2017-12-01
description: 自社カードの法人会員数（契約数）のうち、直近１年間に新たに法人会員契約を締結した法人会員数。