加入した個人会員数
type: TerminologyConcept
description: 自社カードの個人会員数（契約数）のうち、直近１年間に新たに会員契約を締結した個人会員数。
created: 2017-12-01
broader: Ta00145
top concept of: TerminologyConceptScheme
in scheme: TerminologyConceptScheme

RDF description of 加入した個人会員数
primary topic: 加入した個人会員数