延実働日車_1
type: TerminologyConcept
description: 延実在日車のうち、調査期間中に旅客輸送のため走行した各日毎の自動車の数を合計したもの。
created: 2017-12-01
broader: Ta00496
top concept of: TerminologyConceptScheme
in scheme: TerminologyConceptScheme

RDF description of 延実働日車_1
primary topic: 延実働日車_1