営業時間
type: TerminologyConcept
description: 平常の１日の平均営業（操業）時間（売上や仕入がない日であっても、開店（操業）していた場合は含める。）。
created: 2017-12-01
broader: Ta00352
top concept of: TerminologyConceptScheme
in scheme: TerminologyConceptScheme

RDF description of 営業時間
primary topic: 営業時間