RDF description of 営業外収益_2
primary topic: 営業外収益_2

営業外収益_2
type: TerminologyConcept
in scheme: TerminologyConceptScheme
top concept of: TerminologyConceptScheme
broader: Ta00066
created: 2017-12-01
description: 本来の営業活動（本業）以外の活動によって得られる収益のうち、毎期繰り返し発生する収益の額。営業外収益に属するかどうかは、項目の名称によってではなくその企業の主たる営業活動によって発注した収益か否かによって区別される。