１人の世帯が住み込み・寄宿舎等に居住する世帯か否か
type: TerminologyConcept
description: １人の世帯が住み込みの店員や家事手伝いの人、あるいは学校の寄宿舎・寮・会社などの独身寮に単身で入居している世帯であるか否かの別。また、間取り、下宿、アパート、持ち家などで暮らしている単身者の世帯も含む。
created: 2017-12-01
broader: Ta00552
top concept of: TerminologyConceptScheme
in scheme: TerminologyConceptScheme

RDF description of １人の世帯が住み込み・寄宿舎等に居住する世帯か否か
primary topic: １人の世帯が住み込み・寄宿舎等に居住する世帯か否か