RDF description of 育児にかかった費用額
primary topic: 育児にかかった費用額

育児にかかった費用額
type: TerminologyConcept
in scheme: TerminologyConceptScheme
top concept of: TerminologyConceptScheme
broader: Ta00019
created: 2017-12-01
description: 保育費、医療費、家具・寝具等の費用、衣服費、衛生費など乳幼児にかかった費用すべてをいう。