RDF description of 医療機器の分類番号Ａ
primary topic: 医療機器の分類番号Ａ

医療機器の分類番号Ａ
type: TerminologyConcept
in scheme: TerminologyConceptScheme
top concept of: TerminologyConceptScheme
broader: Ta00584
created: 2017-12-01
description: 医療機器統計分類表に基づく分類番号。【平成26年11月 「医療機器・再生医療等製品の分類番号」に定義内容を変更】