医薬部外品の用途区分
type: TerminologyConcept
description: １．国産の原末、原液から生産された医薬部外品、２．輸入された原末、原液から生産された医薬部外品、３．製剤で輸入された医薬部外品、のいずれかを特定するもの。
created: 2017-12-01
broader: Ta00584
top concept of: TerminologyConceptScheme
in scheme: TerminologyConceptScheme

RDF description of 医薬部外品の用途区分
primary topic: 医薬部外品の用途区分