医薬部外品の薬効分類
type: TerminologyConcept
description: 特掲医薬部外品品目表に掲げられている医薬部外品については特掲医薬部外品品目表に示された薬効番号。それ以外の医薬部外品については医薬部外品薬効分類表に示された分類番号。
created: 2017-12-01
broader: Ta00584
in scheme: TerminologyConceptScheme
top concept of: TerminologyConceptScheme

RDF description of 医薬部外品の薬効分類
primary topic: 医薬部外品の薬効分類