医薬部外品の剤型分類
type: TerminologyConcept
description: 特掲医薬部外品品目表に掲げられている医薬部外品については特掲医薬部外品品目表に示された剤型番号。それ以外の医薬部外品については医薬部外品剤型分類表に示された番号。
created: 2017-12-01
broader: Ta00584
top concept of: TerminologyConceptScheme
in scheme: TerminologyConceptScheme

RDF description of 医薬部外品の剤型分類
primary topic: 医薬部外品の剤型分類