常勤の医師数
type: TerminologyConcept
description: 施設が直接雇い入れた者、派遣労働者（紹介予定派遣のみ）、出向者、一般の従事者と同様の勤務状況にある家族従事者のうち、原則としてその施設の勤務時間すべてを勤務する医師の数。
created: 2017-12-01
broader: Ta00119
in scheme: TerminologyConceptScheme
top concept of: TerminologyConceptScheme

RDF description of 常勤の医師数
primary topic: 常勤の医師数