RDF description of 緯度
primary topic: 緯度

緯度
type: TerminologyConcept
description: 地球上の位置を示す赤道に平行な座標。ある地点の天頂の方向と赤道面とのなす角度で表す。赤道をゼロ度とし、南北へそれぞれ南緯・北緯と測り、両極で九〇度に至る。
created: 2017-12-01
broader: Ta00492
in scheme: TerminologyConceptScheme
top concept of: TerminologyConceptScheme