異動事由
type: TerminologyConcept
description: 土地の購入、開墾・開田、土地改良、資産分割による増価、耕心土売却、売却、災害、復旧、資産分割による減価があった場合の理由。
created: 2017-12-01
broader: Ta00653
top concept of: TerminologyConceptScheme
in scheme: TerminologyConceptScheme

RDF description of 異動事由
primary topic: 異動事由