意匠権数
type: TerminologyConcept
description: 開発如何に関わらず、登録料を継続的に支払っている意匠権（物品の形状、模様、色彩についての美感をおこさせるデザインであって、意匠法に従って登録したもの）の件数。
created: 2017-12-01
broader: Ta00457
top concept of: TerminologyConceptScheme
in scheme: TerminologyConceptScheme

RDF description of 意匠権数
primary topic: 意匠権数