意匠権収入額
type: TerminologyConcept
description: 新規・継続を問わず決算年度１年間に、企業との間に意匠権における技術の提供を行った場合の対価の受取金額。
created: 2017-12-01
broader: Ta00060
top concept of: TerminologyConceptScheme
in scheme: TerminologyConceptScheme

RDF description of 意匠権収入額
primary topic: 意匠権収入額