RDF description of 委託研究開発費
primary topic: 委託研究開発費

委託研究開発費
type: TerminologyConcept
in scheme: TerminologyConceptScheme
top concept of: TerminologyConceptScheme
broader: Ta00080
created: 2017-12-01
description: 社外（海外を含む。）に研究開発業務の一部又は全部を委託した場合の委託費や賦課金などの額。研究開発とは、事物、機能、現象などについて新知識を得るために、又は既存の知識の新しい活用の道を開くために行われる創造的な努力及び探求をいい、いわゆる学術的な研究のみならず、製品開発、既存製品の改良及び生産・製造工程の開発や改良に関する活動も含む。