RDF description of 委託の状況
primary topic: 委託の状況

委託の状況
type: TerminologyConcept
in scheme: TerminologyConceptScheme
top concept of: TerminologyConceptScheme
broader: Ta00644
created: 2017-12-01
description: 施設内外における当該業務の委託状況。【平成21年1月28日、元の定義「施設内における当該業務の委託状況」を修正しました。】