委託した水稲作作業
type: TerminologyConcept
description: よそに委託した水稲作作業の種類。委託とは、全作業委託及び作業単位の委託のことである。
created: 2017-12-01
broader: Ta00603
top concept of: TerminologyConceptScheme
in scheme: TerminologyConceptScheme

RDF description of 委託した水稲作作業
primary topic: 委託した水稲作作業