安全管理の責任者の有無
type: TerminologyConcept
description: 安全管理のための計画及び評価、職員の安全管理に関する意識の向上や指導等の業務を行う責任者の有無。
created: 2017-12-01
broader: Ta00639
top concept of: TerminologyConceptScheme
in scheme: TerminologyConceptScheme

RDF description of 安全管理の責任者の有無
primary topic: 安全管理の責任者の有無