安全管理のための医療事故等の院内報告制度の有無
type: TerminologyConcept
description: 医療機関内で発生した医療事故、インシデント等が報告され、その分析を通した改善策を実施するために整備された体制の有無。
created: 2017-12-01
broader: Ta00639
top concept of: TerminologyConceptScheme
in scheme: TerminologyConceptScheme

RDF description of 安全管理のための医療事故等の院内報告制度の有無
primary topic: 安全管理のための医療事故等の院内報告制度の有無