RDF description of 悪性腫瘍手術実施件数
primary topic: 悪性腫瘍手術実施件数

悪性腫瘍手術実施件数
type: TerminologyConcept
in scheme: TerminologyConceptScheme
top concept of: TerminologyConceptScheme
broader: Ta00402
created: 2017-12-01
description: 悪性腫瘍（がん・肉腫等）に対するすべての手術の実施件数。姑息的手術も含む。ただし、内視鏡、胸腔鏡または腹腔鏡による手術を除く。