リース料支出額
type: TerminologyConcept
description: リース契約に基づいて支払った額。リース契約とは、長期間にわたり特定の資産を占有して使用する賃貸借契約であり、物件を使用する期間が１年を越え、契約期間中原則として中途解約できないものを指す。土地・建物の賃借、短期間のレンタル、チャーター、転用リース等は含まない。調査年以前にリース契約した物件に対する支払いリース料を含む。
created: 2017-12-01
broader: Ta00077
in scheme: TerminologyConceptScheme
top concept of: TerminologyConceptScheme

RDF description of リース料支出額
primary topic: リース料支出額