リース年間契約高
type: TerminologyConcept
description: 主たる業務のリース契約高とは、物件を使用させる期間が１年を超え、契約期間中に解約の申し入れができない賃貸契約の金額。注．主たる業務とは、「各種物品賃貸業務」、「産業用機械器具賃貸業務」及び「事務用機械器具賃貸業務」のうち、売上高が最も多い業務をいう。
created: 2017-12-01
broader: Ta00063
in scheme: TerminologyConceptScheme
top concept of: TerminologyConceptScheme

RDF description of リース年間契約高
primary topic: リース年間契約高