RDF description of ユニット家具所有数
primary topic: ユニット家具所有数

ユニット家具所有数
type: TerminologyConcept
in scheme: TerminologyConceptScheme
top concept of: TerminologyConceptScheme
narrower: si327010089
narrower: si327020086
broader: Ta00430
created: 2017-12-01
description: ユニット家具の所有総数。可動家具と作り付け家具の両方の要素を兼ね備えた家具で、ベッド、机、戸棚類などの寸法が統一されており、用途や部屋の大きさにより組み合わせが自由にできるもの。