RDF description of ミルキングパーラー利用台数
primary topic: ミルキングパーラー利用台数

ミルキングパーラー利用台数
type: TerminologyConcept
in scheme: TerminologyConceptScheme
top concept of: TerminologyConceptScheme
broader: Ta00415
created: 2017-12-01
description: 利用したミルキングパーラーの数。ミルキングパーラーとは、専用の搾乳室に牛を集めて、複数の牛を同時に搾乳が出来る施設をいう。所有している機械を利用した台数だけでなく、リース等により、よそから借りてきた機械を利用した場合も利用に含む。