マリンスポーツ場数
type: TerminologyConcept
description: 当該漁業地区内にあるマリンスポーツ場の数。マリンスポーツ場とは、サーフィン、ボードセーリング、水上スキー、水上オートバイ、ダイビング等を行うため海面の一定水域を区切り、区域の表示、海水浴場・漁場との分離、監視員の設置等の管理を行っているものをいう。なお、大会や催し物の開催期間のみマリンスポーツ場として使用し、それ以外は海水浴場等となっているものは対象外とする。
created: 2017-12-01
broader: Ta00407
in scheme: TerminologyConceptScheme
top concept of: TerminologyConceptScheme

RDF description of マリンスポーツ場数
primary topic: マリンスポーツ場数