マリーナ陸上保管最大収容隻数
type: TerminologyConcept
description: ヨット・モータボード等の係留（陸上保管施設を含む。）を目的として建設された港（公共、民間は問わない。）の陸上保管施設での船舶の最大収容隻数。
created: 2017-12-01
broader: Ta00444
top concept of: TerminologyConceptScheme
in scheme: TerminologyConceptScheme

RDF description of マリーナ陸上保管最大収容隻数
primary topic: マリーナ陸上保管最大収容隻数