RDF description of ボンド輸入体積量
primary topic: ボンド輸入体積量

ボンド輸入体積量
type: TerminologyConcept
description: 税関立会検尺により決定されたボンド輸入量を体積の単位（l、kl、m3、Nm3など）で表したもの。ボンド輸入とは、本邦と海外を往来する航空機又は船舶に供給される石油製品として保税地域（製油所、油槽所）に輸入すること。
created: 2017-12-01
broader: Ta00245
in scheme: TerminologyConceptScheme
top concept of: TerminologyConceptScheme