ポジトロンCT検査実施件数
type: TerminologyConcept
description: 患者の体内に投与されたポジトロン（陽電子）を放出するＲＩ（ラジオアイソトープ）の分布をポジトロンＣＴ装置により撮影する検査の実施件数。
created: 2017-12-01
broader: Ta00403
in scheme: TerminologyConceptScheme
top concept of: TerminologyConceptScheme

RDF description of ポジトロンCT検査実施件数
primary topic: ポジトロンCT検査実施件数