ホームページ開設の有無
type: TerminologyConcept
description: 施設がホームページを開設しているかどうかの別。ホームページには、複数施設で協同して開設しているものや業者等に委託して開設しているものも含む。
created: 2017-12-01
broader: Ta00545
top concept of: TerminologyConceptScheme
in scheme: TerminologyConceptScheme

RDF description of ホームページ開設の有無
primary topic: ホームページ開設の有無