RDF description of ペースメーカー手術実施件数
primary topic: ペースメーカー手術実施件数

ペースメーカー手術実施件数
type: TerminologyConcept
in scheme: TerminologyConceptScheme
top concept of: TerminologyConceptScheme
broader: Ta00402
created: 2017-12-01
description: 心臓ペーシングを目的としてペースメーカーを身体に移植するために行う手術の実施件数。電池交換術は除く。