RDF description of ヘイベーラー所有台数
primary topic: ヘイベーラー所有台数

ヘイベーラー所有台数
type: TerminologyConcept
description: 所有しているヘイベーラーの台数。ヘイベーラーとは、刈り取って乾燥させた牧草を圧縮梱包する機械。機械の購入者でなく、実際に機械を管理している者をその機械を所有しているとみなして所有に含む。また、数戸で共有している機械で、現在、当該調査客体が保管・管理している機械も所有に含む。
created: 2017-12-01
broader: Ta00410
in scheme: TerminologyConceptScheme
top concept of: TerminologyConceptScheme