フォーレージハーベスター利用台数
type: TerminologyConcept
description: 利用したフォーレージハーベスターの台数。フォーレージハーベスターとは、飼料を刈り取ると同時に細断してトレーラーなどに積み上げるもので、自走式とトラクターけん引式の両方がある。（アタッチメントを取り外してコーンハーベスターの本体部となるものを含む。）所有している機械を利用した台数だけでなく、リース等により、よそから借りてきた機械を利用した場合も利用に含む。
created: 2017-12-01
broader: Ta00409
top concept of: TerminologyConceptScheme
in scheme: TerminologyConceptScheme

RDF description of フォーレージハーベスター利用台数
primary topic: フォーレージハーベスター利用台数