ビートハーベスター利用台数
type: TerminologyConcept
description: 利用したビートハーベスターの台数。ビートハーベスターとは、てんさいの収穫機で、けん引式タンカー型、搭載式アンローディング型、自走式タンカー型等がある。所有している機械を利用した台数だけでなく、リース等により、よそから借りてきた機械を利用した場合も利用に含む。
created: 2017-12-01
broader: Ta00409
top concept of: TerminologyConceptScheme
in scheme: TerminologyConceptScheme

RDF description of ビートハーベスター利用台数
primary topic: ビートハーベスター利用台数