ハイパーサーミア実施件数
type: TerminologyConcept
description: 電磁波等を利用して、全身もしくは局所を加温することにより行う悪性腫瘍の治療法（温熱療法）の実施件数。
created: 2017-12-01
broader: Ta00402
top concept of: TerminologyConceptScheme
in scheme: TerminologyConceptScheme

RDF description of ハイパーサーミア実施件数
primary topic: ハイパーサーミア実施件数