RDF description of トレーニング場数
primary topic: トレーニング場数

トレーニング場数
type: TerminologyConcept
in scheme: TerminologyConceptScheme
top concept of: TerminologyConceptScheme
broader: Ta00407
created: 2017-12-01
description: 屋内・屋外にあってウエイトトレーニング・サーキットトレーニング等のための設備を有し、もっぱらトレーニングに使用される施設の箇所数。