ソフトウェアの資産額_2
type: TerminologyConcept
description: 研究のために使用したソフトウェアの購入費。１単位当たり10万円以上となるもので、インストールや設定作業、仕様変更などの附随的修正作業の費用も含む。
created: 2017-12-01
broader: Ta00030
in scheme: TerminologyConceptScheme
top concept of: TerminologyConceptScheme

RDF description of ソフトウェアの資産額_2
primary topic: ソフトウェアの資産額_2