RDF description of ステレオセット・CD・MDラジオカセット所有数
primary topic: ステレオセット・CD・MDラジオカセット所有数

ステレオセット・CD・MDラジオカセット所有数
type: TerminologyConcept
in scheme: TerminologyConceptScheme
top concept of: TerminologyConceptScheme
narrower: si327010104
narrower: si327020101
broader: Ta00430
created: 2017-12-01
description: ステレオセット・ＣＤ・ＭＤラジオカセットの所有総数。ステレオセット（コンポ）とは、レコードプレーヤーやＣＤプレーヤー、アンプ、スピーカーの装置を備え、ステレオ演奏ができるものをいう。カーステレオは含めない。ＣＤ・ＭＤラジオカセットとはＣＤプレーヤーの機能がついたラジオカセットをいう。カセットの代わりにＭＤプレーヤがついたものも含める。