パート・アルバイト数_4
type: TerminologyConcept
description: 事業所、企業等で実際に働いている者（他の会社など別経営の事業所から派遣されている者（労働者派遣法にいう派遣労働者）、在籍出向など、他の会社など別経営の事業所に籍がありながら当該事業所に来て働いている者及び下請として他の会社など別経営の事業所で請け負った仕事を請負先である当該事業所に来て行っている者を含む。他の会社など別経営の事業所へ派遣している者（労働者派遣法にいう派遣労働者）、在籍出向など当該事業所に籍がありながら他の会社など別経営の事業所で働いている者及び下請として当該事業所で請け負った仕事を請負先である他の会社など別経営の事業所で行っている者は除く。）のうち、一般に「嘱託」、「パートタイマー」、「アルバイト」又はそれに近い名称で呼ばれている者の数。
created: 2017-12-01
broader: Ta00116
top concept of: TerminologyConceptScheme
in scheme: TerminologyConceptScheme

RDF description of パート・アルバイト数_4
primary topic: パート・アルバイト数_4