RDF description of さとうきび収穫機所有台数
primary topic: さとうきび収穫機所有台数

さとうきび収穫機所有台数
type: TerminologyConcept
in scheme: TerminologyConceptScheme
top concept of: TerminologyConceptScheme
broader: Ta00410
created: 2017-12-01
description: 所有しているさとうきび収穫機の台数。さとうきび収穫機とは、刈り取り、切断、脱葉等を一貫して行うものをいう。機械の購入者でなく、実際に機械を管理している者をその機械を所有しているとみなして所有に含む。また、数戸で共有している機械で、現在、当該調査客体が保管・管理している機械も所有に含む。