サービス事業の産業Ａ
type: TerminologyConcept
description: 企業で行っている「企業活動基本調査用分類表」におけるサービス業の分類。【平成22年３月 定義内容の変更】
created: 2017-12-01
broader: Ta00538
in scheme: TerminologyConceptScheme
top concept of: TerminologyConceptScheme

RDF description of サービス事業の産業Ａ
primary topic: サービス事業の産業Ａ