RDF description of コンピューテッドラジオグラフィーの有無
primary topic: コンピューテッドラジオグラフィーの有無

コンピューテッドラジオグラフィーの有無
type: TerminologyConcept
in scheme: TerminologyConceptScheme
top concept of: TerminologyConceptScheme
broader: Ta00640
created: 2017-12-01
description: デジタル画像処理加算に該当するコンピューテッドラジオグラフィー法を行う装置の有無。