コンピュータの設置台数A
type: TerminologyConcept
description: コンピュータの設置台数。【平成20年10月１日、定義単位項目「コンピュータの設置台数の定義内容変更に伴い、平成20年９月30日までの定義を「コンピュータの設置台数Ａ」として設定】
created: 2017-12-01
broader: Ta00417
top concept of: TerminologyConceptScheme
in scheme: TerminologyConceptScheme

RDF description of コンピュータの設置台数A
primary topic: コンピュータの設置台数A