コンテナ長
type: TerminologyConcept
description: コンテナ長の区分（甲種港湾）。８フィート（９フィート未満）、１０フィート（９フィート以上１１フィート未満）、１２フィート（１１フィート以上２０フィート未満）、２０フィート（２０フィート以上２４フィート未満）、２４フィート（２４フィート以上３５フィート未満）、３５フィート（３５フィート以上４０フィート未満）、４０フィート（４０フィート以上４５フィート未満）、４５フィート（４５フィート以上）。コンテナ長の区分（乙種港湾）その他（２０フィート未満）、２０フィート（２０フィート以上４０フィート未満）、４０フィート（４０フィート以上）。
created: 2017-12-01
broader: Ta00162
top concept of: TerminologyConceptScheme
in scheme: TerminologyConceptScheme

RDF description of コンテナ長
primary topic: コンテナ長