クレジットカード・掛買い・月賦による購入か否か
type: TerminologyConcept
narrower: si323020027
created: 2017-12-01
narrower: si324020050
narrower: si323010021
narrower: si323010009
narrower: si324020065
narrower: si323010051
narrower: si323010054
narrower: si324020077
narrower: si323010066
narrower: si323020059
narrower: si324020083
narrower: si323020006
narrower: si323020018
narrower: si324020009
narrower: si323020079
narrower: si324020071
narrower: si324020074
narrower: si324020059
narrower: si323020062
narrower: si323010073
narrower: si323020041
narrower: si323020056
narrower: si323010006
narrower: si324020047
narrower: si324020041
description: 口座自動振替（あらかじめ銀行などとの契約によって、定期的に預貯金口座から契約先（購入先）に支払われる方法）によって公共料金の支払や、クレジットカード、掛買い、月賦などで購入した品物の代金の支払、その他各種の支払を行っている場合。
narrower: si324020079
narrower: si324020053
narrower: si323010060
narrower: si323020044
in scheme: TerminologyConceptScheme
narrower: si324020086
narrower: si323020074
narrower: si323020077
narrower: si323020068
narrower: si323010039
narrower: si324020056
narrower: si324020030
narrower: si324020044
narrower: si323010030
narrower: si323020047
narrower: si324020015
narrower: si324020018
narrower: si324020068
narrower: si323020050
narrower: si323010042
narrower: si323020053
narrower: si323010027
broader: Ta00555
narrower: si323020012
narrower: si323020065
narrower: si324020036
narrower: si323010070
narrower: si323010012
narrower: si323010045
narrower: si323020071
narrower: si324020021
narrower: si323020030
narrower: si323010036
narrower: si323020033
narrower: si323020024
narrower: si323010024
narrower: si323020083
narrower: si324020012
narrower: si323010048
narrower: si324020024
narrower: si323010063
narrower: si323020015
narrower: si323020086
narrower: si323010015
narrower: si323020021
narrower: si323010057
narrower: si323010018
narrower: si323020009
narrower: si324020033
narrower: si323020036
narrower: si324020027

RDF description of クレジットカード・掛買い・月賦による購入か否か
primary topic: クレジットカード・掛買い・月賦による購入か否か