クレジットカード・掛買い・月賦による購入・現物の品名
type: TerminologyConcept
broader: Ta00580
narrower: si242010061
top concept of: TerminologyConceptScheme
in scheme: TerminologyConceptScheme
narrower: si243010045
narrower: si242020061
narrower: si243020045
created: 2017-12-01
description: クレジットカード、掛買い、月賦により購入したもの（支払ではなく購入の時点で計上する。）又は現物（現物支給、もらい物、自家産、自分の店の商品）の品名。現物支給とは、勤め先から品物や定期券などを支給された場合や、品物の購入の際会社がその一部を負担したため安く買った場合に負担してもらった分を指す。もらい物とは、よそからもらい物をした場合、よそからもてなしを受けた場合、ビール券や図書券などの引換券、図書カードやテレホンカードなどのプリペイドカードをもらった場合を指す。ただし、物々交換や茶菓子程度のもてなし、特売などで安く買った場合の負担分、デパートの商品券は含まない。自家産とは、自家菜園、鶏卵などの生産物を家計用として消費したり、贈答用として使用したりした場合、山海、林野、湖沼、川などから収穫物を家計用として取り入れた場合を指す。自分の店の商品とは、自分の店の品物を家計用として消費したり、贈答用として使用したりした場合のことである。

RDF description of クレジットカード・掛買い・月賦による購入・現物の品名
primary topic: クレジットカード・掛買い・月賦による購入・現物の品名