きまって支給する給与額_2
type: TerminologyConcept
description: 労働契約、労働協約あるいは事業所の給与規則などによってあらかじめ定められている支給条件や算定方法によって支給される給与の額をいい、基本給、勤続給、地域給、能率給、年齢給、歩合給、役付手当、職務手当、特殊作業手当、通勤手当、精皆勤手当、家族手当、住宅手当、超過労働給（時間外勤務手当、深夜勤務手当、休日出勤手当、宿日直手当など）等の合計額。手取額でなく、所得税や社会保険料などを控除する前の額。休業手当など、その日に労働しなくても支給される給与を含む。1か月を超え、3か月以内の期間で算定される生産報奨金、通勤手当、精皆勤手当などを含む（2又は3か月ごとに支給される場合は、1か月分だけ含めるのではなく全額を含める）。現金給与のみで現物給与は含まない。役員報酬は含まない。ベースアップなどによる追給は含まない。
created: 2017-12-01
broader: Ta00088
in scheme: TerminologyConceptScheme
top concept of: TerminologyConceptScheme

RDF description of きまって支給する給与額_2
primary topic: きまって支給する給与額_2