がん検診の受診状況_2
type: TerminologyConcept
description: 過去２年間に、がん検診を受けたことがあるか否か。（健診等（健康診断、健康診査及び人間ドック）の中で受診したものも含む。）
created: 2017-12-01
broader: Ta00632
top concept of: TerminologyConceptScheme
in scheme: TerminologyConceptScheme

RDF description of がん検診の受診状況_2
primary topic: がん検診の受診状況_2